[Dev] HELP - segfault occured during package build

Łukasz Stelmach l.stelmach at samsung.com
Wed Apr 23 07:41:33 GMT 2014


It was <2014-04-23 śro 06:38>, when 한상현 wrote:
> Hello All.
>
> I encountered segmentation fault problem during package build.

[...]

> [  252s] Linking CXX executable empSample/empSample
> [  252s] Generating Signature...please wait...
> [  252s] Success: Xml file is successfully generated!
> [  252s] qemu: uncaught target signal 11 (Segmentation fault) - core dumped
> [  253s] /bin/sh: line 1: 12903 Segmentation fault      (core dumped) mksquashfs /home/
> abuild/rpmbuild/BUILD/sef-emps-0.4/Sample/empSample/ empSample.img
> [  253s] make[2]: *** [Sample/empSample/empSample] Error 139
> [  253s] make[1]: *** [Sample/CMakeFiles/empSample.dir/all] Error 2
> [  253s] make: *** [all] Error 2
> [  253s] error: Bad exit status from /var/tmp/rpm-tmp.bmfIpY (%build)

[...]

> Can you give me a some solution about this problem ?

I am afraid I don't have one at hand. However, I may recomend you
chrooting into GBS build root (gbs chroot command) and running make
manually in the directory where the build failed. You may even try using
strace (launched from outside of the chroot).

-- 
Łukasz Stelmach
Samsung R&D Institute Poland
Samsung Electronics
-------------- next part --------------
A non-text attachment was scrubbed...
Name: not available
Type: application/pgp-signature
Size: 489 bytes
Desc: not available
URL: <http://lists.tizen.org/pipermail/dev/attachments/20140423/44a26b08/attachment.sig>


More information about the Dev mailing list