[Tizen-submit] 31549 declined: home:prerelease:Tizen:IVI:submit:tizen:20150106.075439/efl-util to Tizen:IVI/efl-util

noreply at tizen.org noreply at tizen.org
Tue Jan 6 08:26:06 GMT 2015


Hi Gwanglim Lee,
The following change has been rejected.

Reason:
    SR 31549 is set to declined state. Package build failed in prerelease:
[   82s] In file included from /home/abuild/rpmbuild/BUILD/capi-ui-efl-util-0.1.1/src/efl_util.c:20:0:
[   82s] /home/abuild/rpmbuild/BUILD/capi-ui-efl-util-0.1.1/include/efl_util.h:170:45: error: 'TIZEN_ERROR_EFL_UTIL' undeclared here (not in a function)
[   82s]   EFL_UTIL_ERROR_NOT_SUPPORTED_WINDOW_TYPE = TIZEN_ERROR_EFL_UTIL | 0x01  /**< Window type not supported */
[   82s]                                              ^
[   82s] /home/abuild/rpmbuild/BUILD/capi-ui-efl-util-0.1.1/src/efl_util.c:42:21: error: '_noti_level_access_result_atom' defined but not used [-Werror=unused-variable]
[   82s]  static unsigned int _noti_level_access_result_atom = 0;
[   82s]                      ^
[   82s] /home/abuild/rpmbuild/BUILD/capi-ui-efl-util-0.1.1/src/efl_util.c:404:18: error: '_efl_util_client_message' defined but not used [-Werror=unused-function]
[   82s]  static Eina_Bool _efl_util_client_message(void *data, int type, void *event)
[   82s]                   ^
[   82s] /home/abuild/rpmbuild/BUILD/capi-ui-efl-util-0.1.1/src/efl_util.c:436:36: error: '_notification_error_cb_info_find_by_xwin' defined but not used [-Werror=unused-function]
[   82s]  static notification_error_cb_info *_notification_error_cb_info_find_by_xwin(unsigned int xwin)
[   82s]                                     ^
[   82s] cc1: all warnings being treated as errors

Please fix the issues above and resubmit.

Thanks,
Release Engineering Team

[This message was auto-generated]
---

Request: #31549

  submit:       home:prerelease:Tizen:IVI:submit:tizen:20150106.075439/efl-util -> Tizen:IVI


Message:
Submitter: Gwanglim Lee <gl77.lee at samsung.com>
Comments: Package build failed in prerelease:
[   82s] In file included from /home/abuild/rpmbuild/BUILD/capi-ui-efl-util-0.1.1/src/efl_util.c:20:0:
[   82s] /home/abuild/rpmbuild/BUILD/capi-ui-efl-util-0.1.1/include/efl_util.h:170:45: error: 'TIZEN_ERROR_EFL_UTIL' undeclared here (not in a function)
[   82s]   EFL_UTIL_ERROR_NOT_SUPPORTED_WINDOW_TYPE = TIZEN_ERROR_EFL_UTIL | 0x01  /**< Window type not supported */
[   82s]                                              ^
[   82s] /home/abuild/rpmbuild/BUILD/capi-ui-efl-util-0.1.1/src/efl_util.c:42:21: error: '_noti_level_access_result_atom' defined but not used [-Werror=unused-variable]
[   82s]  static unsigned int _noti_level_access_result_atom = 0;
[   82s]                      ^
[   82s] /home/abuild/rpmbuild/BUILD/capi-ui-efl-util-0.1.1/src/efl_util.c:404:18: error: '_efl_util_client_message' defined but not used [-Werror=unused-function]
[   82s]  static Eina_Bool _efl_util_client_message(void *data, int type, void *event)
[   82s]                   ^
[   82s] /home/abuild/rpmbuild/BUILD/capi-ui-efl-util-0.1.1/src/efl_util.c:436:36: error: '_notification_error_cb_info_find_by_xwin' defined but not used [-Werror=unused-function]
[   82s]  static notification_error_cb_info *_notification_error_cb_info_find_by_xwin(unsigned int xwin)
[   82s]                                     ^
[   82s] cc1: all warnings being treated as errors 
Git project: [platform/core/api/efl-util]
Tag: submit/tizen/20150106.075439
Commit: ad0cc5d56a2b5673408c7b0b146d15341040e799

State:   revoked    2015-01-06T08:25:49 tizenrobot
Comment: The source project 'home:prerelease:Tizen:IVI:submit:tizen:20150106.075439' was removed

History: declined   2015-01-06T08:25:37 tizenrobot
         new        2015-01-06T08:25:37 tizenrobot


More information about the Tizen-submit mailing list