[Tizen-submit] 32166 declined: home:prerelease:Tizen:IVI:submit:tizen:20150120.043506/slp-pkgmgr to Tizen:IVI/slp-pkgmgr

noreply at tizen.org noreply at tizen.org
Wed Jan 21 05:22:34 GMT 2015


Hi Suchang Woo,
The following change has been rejected.

Reason:
    SR 32166 is set to declined state. [  172s] /home/abuild/rpmbuild/BUILD/liblocation-appman-0.1.6/src/location-appman.c: In function 'location_appman_get_name':
[  172s] /home/abuild/rpmbuild/BUILD/liblocation-appman-0.1.6/src/location-appman.c:561:3: error: implicit declaration of function 'app_info_get_name' [-Werror=implicit-function-declaration]
[  172s]    app_info_get_name(app_info, &name);
[  172s]    ^
liblocation-appman build failed in prerelease:
[  172s] /home/abuild/rpmbuild/BUILD/liblocation-appman-0.1.6/src/location-appman.c: In function 'location_appman_get_package_by_pid':
[  172s] /home/abuild/rpmbuild/BUILD/liblocation-appman-0.1.6/src/location-appman.c:886:2: error: implicit declaration of function 'app_manager_get_package' [-Werror=implicit-function-declaration]
[  172s]   ret = app_manager_get_package(pid, &package);
[  172s]   ^
[  172s] cc1: all warnings being treated as errors

Please fix the issues above and resubmit.

Thanks,
Release Engineering Team

[This message was auto-generated]
---

Request: #32166

  submit:       home:prerelease:Tizen:IVI:submit:tizen:20150120.043506/app-core -> Tizen:IVI
  submit:       home:prerelease:Tizen:IVI:submit:tizen:20150120.043506/app-manager -> Tizen:IVI
  submit:       home:prerelease:Tizen:IVI:submit:tizen:20150120.043506/appcore-agent -> Tizen:IVI
  submit:       home:prerelease:Tizen:IVI:submit:tizen:20150120.043506/application -> Tizen:IVI
  submit:       home:prerelease:Tizen:IVI:submit:tizen:20150120.043506/aul-1 -> Tizen:IVI
  submit:       home:prerelease:Tizen:IVI:submit:tizen:20150120.043506/package-manager -> Tizen:IVI
  submit:       home:prerelease:Tizen:IVI:submit:tizen:20150120.043506/pkgmgr-info -> Tizen:IVI
  submit:       home:prerelease:Tizen:IVI:submit:tizen:20150120.043506/rpm-installer -> Tizen:IVI
  submit:       home:prerelease:Tizen:IVI:submit:tizen:20150120.043506/slp-pkgmgr -> Tizen:IVI


Message:
Submitter: Suchang Woo <suchang.woo at samsung.com>
Comments: [  172s] /home/abuild/rpmbuild/BUILD/liblocation-appman-0.1.6/src/location-appman.c: In function 'location_appman_get_name':
[  172s] /home/abuild/rpmbuild/BUILD/liblocation-appman-0.1.6/src/location-appman.c:561:3: error: implicit declaration of function 'app_info_get_name' [-Werror=implicit-function-declaration]
[  172s]    app_info_get_name(app_info, &name);
[  172s]    ^
liblocation-appman build failed in prerelease:
[  172s] /home/abuild/rpmbuild/BUILD/liblocation-appman-0.1.6/src/location-appman.c: In function 'location_appman_get_package_by_pid':
[  172s] /home/abuild/rpmbuild/BUILD/liblocation-appman-0.1.6/src/location-appman.c:886:2: error: implicit declaration of function 'app_manager_get_package' [-Werror=implicit-function-declaration]
[  172s]   ret = app_manager_get_package(pid, &package);
[  172s]   ^
[  172s] cc1: all warnings being treated as errors 
Git project: [platform/core/appfw/appcore-agent, platform/core/base/rpm-installer, platform/core/appfw/pkgmgr-info, platform/core/appfw/aul-1, platform/core/appfw/slp-pkgmgr, platform/core/api/package-manager, platform/core/api/application, platform/core/api/app-manager, platform/core/appfw/app-core]
Tag: submit/tizen/20150120.043506
Commit: 7fcf86fe657ccd96d831385e8e47631eaf7a9565

State:   revoked    2015-01-21T05:22:21 tizenrobot
Comment: The source project 'home:prerelease:Tizen:IVI:submit:tizen:20150120.043506' was removed

History: declined   2015-01-21T05:22:08 tizenrobot
         new        2015-01-21T05:22:06 tizenrobot


More information about the Tizen-submit mailing list