[Tizen-submit] 36452 declined: home:prerelease:Tizen:Wearable:submit:tizen:20150601.103851/image-util to Tizen:Wearable/image-util

noreply at tizen.org noreply at tizen.org
Tue Jun 2 05:15:12 GMT 2015


Hi Haejeong Kim,
The following change has been rejected.

Reason:
    SR 36452 is set to declinedimage-util pkg build failed in all repositories:

[  340s] /home/abuild/rpmbuild/BUILD/capi-media-image-util-0.1.2/src/image_util.c:72:2: error: 'MM_UTIL_JPEG_DECODE_DOWNSCALE_1_1' undeclared here (not in a function)
[  340s]   MM_UTIL_JPEG_DECODE_DOWNSCALE_1_1,
[  340s]   ^
[  340s] /home/abuild/rpmbuild/BUILD/capi-media-image-util-0.1.2/src/image_util.c:73:2: error: 'MM_UTIL_JPEG_DECODE_DOWNSCALE_1_2' undeclared here (not in a function)
[  340s]   MM_UTIL_JPEG_DECODE_DOWNSCALE_1_2,
[  340s]   ^
[  340s] /home/abuild/rpmbuild/BUILD/capi-media-image-util-0.1.2/src/image_util.c:74:2: error: 'MM_UTIL_JPEG_DECODE_DOWNSCALE_1_4' undeclared here (not in a function)
[  340s]   MM_UTIL_JPEG_DECODE_DOWNSCALE_1_4,
[  340s]   ^
[  340s] /home/abuild/rpmbuild/BUILD/capi-media-image-util-0.1.2/src/image_util.c:75:2: error: 'MM_UTIL_JPEG_DECODE_DOWNSCALE_1_8' undeclared here (not in a function)
[  340s]   MM_UTIL_JPEG_DECODE_DOWNSCALE_1_8,
[  340s]   ^

Please check the build status.

Thanks,
Joonsub Lee

Please fix the issues above and resubmit.

Thanks,
Release Engineering Team

[This message was auto-generated]
---

Request: #36452

  submit:       home:prerelease:Tizen:Wearable:submit:tizen:20150601.103851/image-util -> Tizen:Wearable


Message:
Submitter: hj kim <backto.kim at samsung.com>
Comments: image-util pkg build failed in all repositories:

[  340s] /home/abuild/rpmbuild/BUILD/capi-media-image-util-0.1.2/src/image_util.c:72:2: error: 'MM_UTIL_JPEG_DECODE_DOWNSCALE_1_1' undeclared here (not in a function)
[  340s]   MM_UTIL_JPEG_DECODE_DOWNSCALE_1_1,
[  340s]   ^
[  340s] /home/abuild/rpmbuild/BUILD/capi-media-image-util-0.1.2/src/image_util.c:73:2: error: 'MM_UTIL_JPEG_DECODE_DOWNSCALE_1_2' undeclared here (not in a function)
[  340s]   MM_UTIL_JPEG_DECODE_DOWNSCALE_1_2,
[  340s]   ^
[  340s] /home/abuild/rpmbuild/BUILD/capi-media-image-util-0.1.2/src/image_util.c:74:2: error: 'MM_UTIL_JPEG_DECODE_DOWNSCALE_1_4' undeclared here (not in a function)
[  340s]   MM_UTIL_JPEG_DECODE_DOWNSCALE_1_4,
[  340s]   ^
[  340s] /home/abuild/rpmbuild/BUILD/capi-media-image-util-0.1.2/src/image_util.c:75:2: error: 'MM_UTIL_JPEG_DECODE_DOWNSCALE_1_8' undeclared here (not in a function)
[  340s]   MM_UTIL_JPEG_DECODE_DOWNSCALE_1_8,
[  340s]   ^

Please check the build status.

Thanks,
Joonsub Lee 
Git project: [platform/core/api/image-util]
Tag: submit/tizen/20150601.103851

State:   revoked    2015-06-02T05:14:57 tizenrobot
Comment: The source project 'home:prerelease:Tizen:Wearable:submit:tizen:20150601.103851' was removed

History: declined   2015-06-02T05:14:45 joonsub1
         new        2015-06-02T05:14:43 joonsub1


More information about the Tizen-submit mailing list