[Tizen-submit] 36456 declined: home:prerelease:Tizen:Mobile:submit:tizen:20150601.120843/cert-svc to Tizen:Mobile/cert-svc

noreply at tizen.org noreply at tizen.org
Tue Jun 2 05:21:53 GMT 2015


Hi Dongsun Lee,
The following change has been rejected.

Reason:
    SR 36456 is set to declinedbluetooth-agent, cert-svc-ui, email-service packages have dependency with cert-svc so those packages are build failed in prerelease project.
Please check above packages build status and make group submission.

And also, cert-svc pkg build failed in 64bit repositories:

[  255s] /home/abuild/rpmbuild/BUILD/cert-svc-1.0.1/vcore/src/vcore/Certificate.cpp:146:76: error: cannot convert 'size_t* {aka long unsigned int*}' to 'unsigned int*' for argument '4' to 'int X509_digest(const X509*, const EVP_MD*, unsigned char*, unsigned int*)'
[  255s]                                                                             ^
[  255s] /home/abuild/rpmbuild/BUILD/cert-svc-1.0.1/vcore/src/vcore/Certificate.cpp:155:44: error: cannot convert 'size_t* {aka long unsigned int*}' to 'unsigned int*' for argument '4' to 'int X509_digest(const X509*, const EVP_MD*, unsigned char*, unsigned int*)'
[  255s]                           &fingerprintlength))
[  255s]                                             ^

Please check the build status.

Thanks,
Joonsub Lee

Please fix the issues above and resubmit.

Thanks,
Release Engineering Team

[This message was auto-generated]
---

Request: #36456

  submit:       home:prerelease:Tizen:Mobile:submit:tizen:20150601.120843/cert-svc -> Tizen:Mobile


Message:
Submitter: Dong Sun Lee <ds73.lee at samsung.com>
Comments: bluetooth-agent, cert-svc-ui, email-service packages have dependency with cert-svc so those packages are build failed in prerelease project.
Please check above packages build status and make group submission.

And also, cert-svc pkg build failed in 64bit repositories:

[  255s] /home/abuild/rpmbuild/BUILD/cert-svc-1.0.1/vcore/src/vcore/Certificate.cpp:146:76: error: cannot convert 'size_t* {aka long unsigned int*}' to 'unsigned int*' for argument '4' to 'int X509_digest(const X509*, const EVP_MD*, unsigned char*, unsigned int*)'
[  255s]                                                                             ^
[  255s] /home/abuild/rpmbuild/BUILD/cert-svc-1.0.1/vcore/src/vcore/Certificate.cpp:155:44: error: cannot convert 'size_t* {aka long unsigned int*}' to 'unsigned int*' for argument '4' to 'int X509_digest(const X509*, const EVP_MD*, unsigned char*, unsigned int*)'
[  255s]                           &fingerprintlength))
[  255s]                                             ^

Please check the build status.

Thanks,
Joonsub Lee 
Git project: [platform/core/security/cert-svc]
Tag: submit/tizen/20150601.120843

State:   revoked    2015-06-02T05:21:44 tizenrobot
Comment: The source project 'home:prerelease:Tizen:Mobile:submit:tizen:20150601.120843' was removed

History: declined   2015-06-02T05:21:30 joonsub1
         new        2015-06-02T05:21:28 joonsub1


More information about the Tizen-submit mailing list