[Tizen-submit] 37560 declined: home:prerelease:Tizen:Common:submit:tizen:20150611.091025/lbs-location to Tizen:Common/lbs-location

noreply at tizen.org noreply at tizen.org
Thu Jun 11 10:20:23 GMT 2015


Hi Young-Ae Kang,
The following change has been rejected.

Reason:
    SR 37560 is set to declined

BUILD ERRORS: (please, check BEFORE submit)

[  175s] /home/abuild/rpmbuild/BUILD/liblbs-location-0.12.0/location/manager/location-setting.c: In function 'convert_event_from_key':
[  175s] /home/abuild/rpmbuild/BUILD/liblbs-location-0.12.0/location/manager/location-setting.c:81:21: error: 'VCONFKEY_LOCATION_USE_MY_LOCATION' undeclared (first use in this function)
[  175s]   if (g_strcmp0(key, VCONFKEY_LOCATION_USE_MY_LOCATION) == 0) {
[  175s]                      ^
[  175s] /home/abuild/rpmbuild/BUILD/liblbs-location-0.12.0/location/manager/location-setting.c:81:21: note: each undeclared identifier is reported only once for each function it appears in
[  175s] location/CMakeFiles/lbs-location.dir/build.make:126: recipe for target 'location/CMakeFiles/lbs-location.dir/manager/location-setting.c.o' failed
[  175s] make[2]: *** [location/CMakeFiles/lbs-location.dir/manager/location-setting.c.o] Error 1
[  175s] make[2]: *** Waiting for unfinished jobs....
[  175s] /home/abuild/rpmbuild/BUILD/liblbs-location-0.12.0/location/manager/location.c: In function '__convert_setting_key':
[  175s] /home/abuild/rpmbuild/BUILD/liblbs-location-0.12.0/location/manager/location.c:58:19: error: 'VCONFKEY_LOCATION_USE_MY_LOCATION' undeclared (first use in this function)
[  175s]     key = g_strdup(VCONFKEY_LOCATION_USE_MY_LOCATION);
[  175s]                    ^
[  175s] /home/abuild/rpmbuild/BUILD/liblbs-location-0.12.0/location/manager/location.c:58:19: note: each undeclared identifier is reported only once for each function it appears in
[  175s] /home/abuild/rpmbuild/BUILD/liblbs-location-0.12.0/location/manager/location.c: In function '__convert_method_from_key':
[  175s] /home/abuild/rpmbuild/BUILD/liblbs-location-0.12.0/location/manager/location.c:76:21: error: 'VCONFKEY_LOCATION_USE_MY_LOCATION' undeclared (first use in this function)
[  175s]   if (g_strcmp0(key, VCONFKEY_LOCATION_USE_MY_LOCATION) == 0) {
[  175s]                      ^


Please fix the issues above and resubmit.

Thanks,
Release Engineering Team

[This message was auto-generated]
---

Request: #37560

  submit:       home:prerelease:Tizen:Common:submit:tizen:20150611.091025/lbs-location -> Tizen:Common


Message:
Submitter: Youngae Kang <youngae.kang at samsung.com>
Comments: 

BUILD ERRORS: (please, check BEFORE submit)

[  175s] /home/abuild/rpmbuild/BUILD/liblbs-location-0.12.0/location/manager/location-setting.c: In function 'convert_event_from_key':
[  175s] /home/abuild/rpmbuild/BUILD/liblbs-location-0.12.0/location/manager/location-setting.c:81:21: error: 'VCONFKEY_LOCATION_USE_MY_LOCATION' undeclared (first use in this function)
[  175s]   if (g_strcmp0(key, VCONFKEY_LOCATION_USE_MY_LOCATION) == 0) {
[  175s]                      ^
[  175s] /home/abuild/rpmbuild/BUILD/liblbs-location-0.12.0/location/manager/location-setting.c:81:21: note: each undeclared identifier is reported only once for each function it appears in
[  175s] location/CMakeFiles/lbs-location.dir/build.make:126: recipe for target 'location/CMakeFiles/lbs-location.dir/manager/location-setting.c.o' failed
[  175s] make[2]: *** [location/CMakeFiles/lbs-location.dir/manager/location-setting.c.o] Error 1
[  175s] make[2]: *** Waiting for unfinished jobs....
[  175s] /home/abuild/rpmbuild/BUILD/liblbs-location-0.12.0/location/manager/location.c: In function '__convert_setting_key':
[  175s] /home/abuild/rpmbuild/BUILD/liblbs-location-0.12.0/location/manager/location.c:58:19: error: 'VCONFKEY_LOCATION_USE_MY_LOCATION' undeclared (first use in this function)
[  175s]     key = g_strdup(VCONFKEY_LOCATION_USE_MY_LOCATION);
[  175s]                    ^
[  175s] /home/abuild/rpmbuild/BUILD/liblbs-location-0.12.0/location/manager/location.c:58:19: note: each undeclared identifier is reported only once for each function it appears in
[  175s] /home/abuild/rpmbuild/BUILD/liblbs-location-0.12.0/location/manager/location.c: In function '__convert_method_from_key':
[  175s] /home/abuild/rpmbuild/BUILD/liblbs-location-0.12.0/location/manager/location.c:76:21: error: 'VCONFKEY_LOCATION_USE_MY_LOCATION' undeclared (first use in this function)
[  175s]   if (g_strcmp0(key, VCONFKEY_LOCATION_USE_MY_LOCATION) == 0) {
[  175s]                      ^
 
Git project: [platform/core/location/lbs-location]
Tag: submit/tizen/20150611.091025

State:   declined   2015-06-11T10:19:34 jobol
Comment: SR 37560 is set to declined

BUILD ERRORS: (please, check BEFORE submit)

[  175s] /home/abuild/rpmbuild/BUILD/liblbs-location-0.12.0/location/manager/location-setting.c: In function 'convert_event_from_key':
[  175s] /home/abuild/rpmbuild/BUILD/liblbs-location-0.12.0/location/manager/location-setting.c:81:21: error: 'VCONFKEY_LOCATION_USE_MY_LOCATION' undeclared (first use in this function)
[  175s]   if (g_strcmp0(key, VCONFKEY_LOCATION_USE_MY_LOCATION) == 0) {
[  175s]                      ^
[  175s] /home/abuild/rpmbuild/BUILD/liblbs-location-0.12.0/location/manager/location-setting.c:81:21: note: each undeclared identifier is reported only once for each function it appears in
[  175s] location/CMakeFiles/lbs-location.dir/build.make:126: recipe for target 'location/CMakeFiles/lbs-location.dir/manager/location-setting.c.o' failed
[  175s] make[2]: *** [location/CMakeFiles/lbs-location.dir/manager/location-setting.c.o] Error 1
[  175s] make[2]: *** Waiting for unfinished jobs....
[  175s] /home/abuild/rpmbuild/BUILD/liblbs-location-0.12.0/location/manager/location.c: In function '__convert_setting_key':
[  175s] /home/abuild/rpmbuild/BUILD/liblbs-location-0.12.0/location/manager/location.c:58:19: error: 'VCONFKEY_LOCATION_USE_MY_LOCATION' undeclared (first use in this function)
[  175s]     key = g_strdup(VCONFKEY_LOCATION_USE_MY_LOCATION);
[  175s]                    ^
[  175s] /home/abuild/rpmbuild/BUILD/liblbs-location-0.12.0/location/manager/location.c:58:19: note: each undeclared identifier is reported only once for each function it appears in
[  175s] /home/abuild/rpmbuild/BUILD/liblbs-location-0.12.0/location/manager/location.c: In function '__convert_method_from_key':
[  175s] /home/abuild/rpmbuild/BUILD/liblbs-location-0.12.0/location/manager/location.c:76:21: error: 'VCONFKEY_LOCATION_USE_MY_LOCATION' undeclared (first use in this function)
[  175s]   if (g_strcmp0(key, VCONFKEY_LOCATION_USE_MY_LOCATION) == 0) {
[  175s]                      ^

History: new        2015-06-11T10:19:32 jobol


More information about the Tizen-submit mailing list