[Tizen-submit] 37596 declined: home:prerelease:Tizen:TV:submit:tizen:20150611.060034/vconf-internal-keys to Tizen:TV/vconf-internal-keys

noreply at tizen.org noreply at tizen.org
Thu Jun 11 12:28:19 GMT 2015


Hi Suchang Woo,
The following change has been rejected.

Reason:
    SR 37596 is set to declined
build fail in the runtime-info

[   84s] /home/abuild/rpmbuild/BUILD/capi-system-runtime-info-0.0.3/src/runtime_info_location.c:34:50: error: VCONFKEY_LOCATION_AGPS_ENABLED undeclared here (not in a function)
[   84s]  static const char *VCONF_LOCATION_AGPS_ENABLED = VCONFKEY_LOCATION_AGPS_ENABLED;
[   84s]                                                   ^
[   84s] CMakeFiles/capi-system-runtime-info.dir/build.make:129: recipe for target CMakeFiles/capi-system-runtime-info.dir/src/runtime_info_location.c.o failed
[   84s] make[2]: *** [CMakeFiles/capi-system-runtime-info.dir/src/runtime_info_location.c.o] Error 1
[   84s] make[2]: *** Waiting for unfinished jobs....



Please fix the issues above and resubmit.

Thanks,
Release Engineering Team

[This message was auto-generated]
---

Request: #37596

  submit:       home:prerelease:Tizen:TV:submit:tizen:20150611.060034/vconf-internal-keys -> Tizen:TV


Message:
Submitter: Suchang Woo <suchang.woo at samsung.com>
Comments: 
build fail in the runtime-info

[   84s] /home/abuild/rpmbuild/BUILD/capi-system-runtime-info-0.0.3/src/runtime_info_location.c:34:50: error: VCONFKEY_LOCATION_AGPS_ENABLED undeclared here (not in a function)
[   84s]  static const char *VCONF_LOCATION_AGPS_ENABLED = VCONFKEY_LOCATION_AGPS_ENABLED;
[   84s]                                                   ^
[   84s] CMakeFiles/capi-system-runtime-info.dir/build.make:129: recipe for target CMakeFiles/capi-system-runtime-info.dir/src/runtime_info_location.c.o failed
[   84s] make[2]: *** [CMakeFiles/capi-system-runtime-info.dir/src/runtime_info_location.c.o] Error 1
[   84s] make[2]: *** Waiting for unfinished jobs....

 
Git project: [platform/core/appfw/vconf-internal-keys]
Tag: submit/tizen/20150611.060034

State:   declined   2015-06-11T12:27:42 hglee
Comment: SR 37596 is set to declined
build fail in the runtime-info

[   84s] /home/abuild/rpmbuild/BUILD/capi-system-runtime-info-0.0.3/src/runtime_info_location.c:34:50: error: VCONFKEY_LOCATION_AGPS_ENABLED undeclared here (not in a function)
[   84s]  static const char *VCONF_LOCATION_AGPS_ENABLED = VCONFKEY_LOCATION_AGPS_ENABLED;
[   84s]                                                   ^
[   84s] CMakeFiles/capi-system-runtime-info.dir/build.make:129: recipe for target CMakeFiles/capi-system-runtime-info.dir/src/runtime_info_location.c.o failed
[   84s] make[2]: *** [CMakeFiles/capi-system-runtime-info.dir/src/runtime_info_location.c.o] Error 1
[   84s] make[2]: *** Waiting for unfinished jobs....

History: new        2015-06-11T12:27:37 hglee


More information about the Tizen-submit mailing list