[Tizen-submit] 37954 declined: home:prerelease:Tizen:TV:submit:tizen:20150616.090753/mediacodec to Tizen:TV/mediacodec

noreply at tizen.org noreply at tizen.org
Wed Jun 17 01:25:13 GMT 2015


Hi Jeon Hee Chul,
The following change has been rejected.

Reason:
    SR 37954 is set to declinedmediacodec package build failed in all repositories:
[  116s] /usr/lib/libelementary.so.1: error adding symbols: DSO missing from command line
[  116s] /home/abuild/rpmbuild/BUILD/capi-media-codec-0.4.0/test/media_codec_test.c:1458: error: undefined reference to 'elm_exit'
[  116s] collect2: error: ld returned 1 exit status

Please check the build status.

Thanks,
Joonsub Lee

Please fix the issues above and resubmit.

Thanks,
Release Engineering Team

[This message was auto-generated]
---

Request: #37954

  submit:       home:prerelease:Tizen:TV:submit:tizen:20150616.090753/mediacodec -> Tizen:TV


Message:
Submitter: Heechul Jeon <heechul.jeon at samsung.com>
Comments: mediacodec package build failed in all repositories:
[  116s] /usr/lib/libelementary.so.1: error adding symbols: DSO missing from command line
[  116s] /home/abuild/rpmbuild/BUILD/capi-media-codec-0.4.0/test/media_codec_test.c:1458: error: undefined reference to 'elm_exit'
[  116s] collect2: error: ld returned 1 exit status

Please check the build status.

Thanks,
Joonsub Lee 
Git project: [platform/core/api/mediacodec]
Tag: submit/tizen/20150616.090753

State:   revoked    2015-06-17T01:24:43 tizenrobot
Comment: The source project 'home:prerelease:Tizen:TV:submit:tizen:20150616.090753' was removed

History: declined   2015-06-17T01:24:14 joonsub1
         new        2015-06-17T01:24:09 joonsub1


More information about the Tizen-submit mailing list