[Tizen-submit] 38271 declined: home:prerelease:Tizen:TV:submit:tizen_tv:20150624.203151/chromium-efl to Tizen:TV/chromium-efl

noreply at tizen.org noreply at tizen.org
Thu Jun 25 00:58:12 GMT 2015


Hi buildbot,
The following change has been rejected.

Reason:
    SR 38271 is set to declined
Build Error nwrt package
[  146s] /home/abuild/rpmbuild/BUILD/wrt-2.0.0/src/runtime/web_application.cc:183:45: error: invalid user-defined conversion from wrt::{anonymous}::InitializeNotificationCallback(Ewk_Context*, wrt::WebApplication*)::<lambda(Ewk_Context*, uint64_t, void*)> to Ewk_Context_Notification_Cancel_Callback {aka void (*)(long long unsigned int, void*)} [-fpermissive]
[  146s]                                           app);
[  146s]                                              ^
[  146s] /home/abuild/rpmbuild/BUILD/wrt-2.0.0/src/runtime/web_application.cc:176:24: note: candidate is: wrt::{anonymous}::InitializeNotificationCallback(Ewk_Context*, wrt::WebApplication*)::<lambda(Ewk_Context*, uint64_t, void*)>::operator void (*)(Ewk_Context*, uint64_t, void*)() const <near match>
[  146s]                   void *) {
[  146s]                         ^
[  146s] /home/abuild/rpmbuild/BUILD/wrt-2.0.0/src/runtime/web_application.cc:176:24: note:   no known conversion from void (*)(Ewk_Context*, uint64_t, void*) {aka void (*)(Ewk_Context*, long long unsigned int, void*)} to Ewk_Context_Notification_Cancel_Callback {aka void (*)(long long unsigned int, void*)}
[  146s] [ 97%] Building CXX object src/runtime/CMakeFiles/wrt.dir/notification_manager.cc.o
[  146s] src/runtime/CMakeFiles/wrt.dir/build.make:126: recipe for target src/runtime/CMakeFiles/wrt.dir/web_application.cc.o failed
[  146s] make[2]: *** [src/runtime/CMakeFiles/wrt.dir/web_application.cc.o] Error 1



Please fix the issues above and resubmit.

Thanks,
Release Engineering Team

[This message was auto-generated]
---

Request: #38271

  submit:       home:prerelease:Tizen:TV:submit:tizen_tv:20150624.203151/chromium-efl -> Tizen:TV


Message:
Submitter: Youngsoo Choi <kenshin.choi at samsung.com>
Comments: 
Build Error nwrt package
[  146s] /home/abuild/rpmbuild/BUILD/wrt-2.0.0/src/runtime/web_application.cc:183:45: error: invalid user-defined conversion from wrt::{anonymous}::InitializeNotificationCallback(Ewk_Context*, wrt::WebApplication*)::<lambda(Ewk_Context*, uint64_t, void*)> to Ewk_Context_Notification_Cancel_Callback {aka void (*)(long long unsigned int, void*)} [-fpermissive]
[  146s]                                           app);
[  146s]                                              ^
[  146s] /home/abuild/rpmbuild/BUILD/wrt-2.0.0/src/runtime/web_application.cc:176:24: note: candidate is: wrt::{anonymous}::InitializeNotificationCallback(Ewk_Context*, wrt::WebApplication*)::<lambda(Ewk_Context*, uint64_t, void*)>::operator void (*)(Ewk_Context*, uint64_t, void*)() const <near match>
[  146s]                   void *) {
[  146s]                         ^
[  146s] /home/abuild/rpmbuild/BUILD/wrt-2.0.0/src/runtime/web_application.cc:176:24: note:   no known conversion from void (*)(Ewk_Context*, uint64_t, void*) {aka void (*)(Ewk_Context*, long long unsigned int, void*)} to Ewk_Context_Notification_Cancel_Callback {aka void (*)(long long unsigned int, void*)}
[  146s] [ 97%] Building CXX object src/runtime/CMakeFiles/wrt.dir/notification_manager.cc.o
[  146s] src/runtime/CMakeFiles/wrt.dir/build.make:126: recipe for target src/runtime/CMakeFiles/wrt.dir/web_application.cc.o failed
[  146s] make[2]: *** [src/runtime/CMakeFiles/wrt.dir/web_application.cc.o] Error 1

 
Git project: [platform/framework/web/chromium-efl]
Tag: submit/tizen_tv/20150624.203151

State:   revoked    2015-06-25T00:57:54 tizenrobot
Comment: The source project 'home:prerelease:Tizen:TV:submit:tizen_tv:20150624.203151' was removed

History: declined   2015-06-25T00:57:44 hglee
         new        2015-06-25T00:57:43 hglee


More information about the Tizen-submit mailing list