[Tizen-submit] 35869 declined: home:prerelease:Tizen:Mobile:submit:tizen:20150519.102410/efl to Tizen:Mobile/efl

noreply at tizen.org noreply at tizen.org
Wed May 20 08:22:22 GMT 2015


Hi Jihoon Kim,
The following change has been rejected.

Reason:
    SR 35869 is set to declinedefl package build failed in x11 repositories:
[  600s] modules/ecore_buffer/x11_dri3/ecore_buffer_x11_dri3.c:537:23: error: too few arguments to function 'tbm_surface_internal_create_with_bos'
[  600s]     buf->tbm_surface = tbm_surface_internal_create_with_bos(&info, &bo, 1);

Please check the build status.

Thanks,
Joonsub Lee

Please fix the issues above and resubmit.

Thanks,
Release Engineering Team

[This message was auto-generated]
---

Request: #35869

  submit:       home:prerelease:Tizen:Mobile:submit:tizen:20150519.102410/efl -> Tizen:Mobile


Message:
Submitter: Jihoon Kim <jihoon48.kim at samsung.com>
Comments: efl package build failed in x11 repositories:
[  600s] modules/ecore_buffer/x11_dri3/ecore_buffer_x11_dri3.c:537:23: error: too few arguments to function 'tbm_surface_internal_create_with_bos'
[  600s]     buf->tbm_surface = tbm_surface_internal_create_with_bos(&info, &bo, 1);

Please check the build status.

Thanks,
Joonsub Lee 
Git project: [platform/upstream/efl]
Tag: submit/tizen/20150519.102410

State:   declined   2015-05-20T08:21:48 joonsub1
Comment: SR 35869 is set to declinedefl package build failed in x11 repositories:
[  600s] modules/ecore_buffer/x11_dri3/ecore_buffer_x11_dri3.c:537:23: error: too few arguments to function 'tbm_surface_internal_create_with_bos'
[  600s]     buf->tbm_surface = tbm_surface_internal_create_with_bos(&info, &bo, 1);

Please check the build status.

Thanks,
Joonsub Lee

History: new        2015-05-20T08:21:46 joonsub1


More information about the Tizen-submit mailing list