[Tizen-submit] 46527 declined: home:prerelease:Tizen:TV:submit:tizen:20151109.122126/syspopup to Tizen:TV/syspopup

noreply at tizen.org noreply at tizen.org
Mon Nov 9 23:30:58 GMT 2015


Hi Hwankyu Jhun,
The following change has been rejected.

Reason:
    SR 46527 is set to declined
net-config and some sample apps have build failure in all repositories:

*net-config:
[  147s] /home/abuild/rpmbuild/BUILD/net-config-1.1.44/src/wifi-state.c:20:17: fatal error: aul.h: No such file or directory

*volume-app(Tizen:Mobile):
[  124s] /home/abuild/rpmbuild/BUILD/org.tizen.volume-0.1.148/src/main.c:116: error: undefined reference to '__dlog_print'

*homescreen-efl(Tizen:Mobile):
[  141s] /home/abuild/rpmbuild/BUILD/org.tizen.homescreen-efl-0.0.1/src/db/db.c:292: error: undefined reference to 'sqlite3_exec'
[  141s] /home/abuild/rpmbuild/BUILD/org.tizen.homescreen-efl-0.0.1/src/db/db.c:296: error: undefined reference to 'sqlite3_close'
[  141s] /home/abuild/rpmbuild/BUILD/org.tizen.homescreen-efl-0.0.1/src/db/db.c:277: error: undefined reference to 'sqlite3_open'
...

Please check the build status.

Thanks,
Joonsub Lee

Please fix the issues above and resubmit.

Thanks,
Release Engineering Team

[This message was auto-generated]
---

Request: #46527

  submit:       home:prerelease:Tizen:TV:submit:tizen:20151109.122126/syspopup -> Tizen:TV


Message:
Submitter: HwanKyu Jhun <h.jhun at samsung.com>
Comments: 
net-config and some sample apps have build failure in all repositories:

*net-config:
[  147s] /home/abuild/rpmbuild/BUILD/net-config-1.1.44/src/wifi-state.c:20:17: fatal error: aul.h: No such file or directory

*volume-app(Tizen:Mobile):
[  124s] /home/abuild/rpmbuild/BUILD/org.tizen.volume-0.1.148/src/main.c:116: error: undefined reference to '__dlog_print'

*homescreen-efl(Tizen:Mobile):
[  141s] /home/abuild/rpmbuild/BUILD/org.tizen.homescreen-efl-0.0.1/src/db/db.c:292: error: undefined reference to 'sqlite3_exec'
[  141s] /home/abuild/rpmbuild/BUILD/org.tizen.homescreen-efl-0.0.1/src/db/db.c:296: error: undefined reference to 'sqlite3_close'
[  141s] /home/abuild/rpmbuild/BUILD/org.tizen.homescreen-efl-0.0.1/src/db/db.c:277: error: undefined reference to 'sqlite3_open'
...

Please check the build status.

Thanks,
Joonsub Lee 
Git project: [platform/core/base/syspopup]
Tag: submit/tizen/20151109.122126

State:   revoked    2015-11-09T23:30:47 tizenrobot
Comment: The source project 'home:prerelease:Tizen:TV:submit:tizen:20151109.122126' was removed

History: declined   2015-11-09T23:30:35 joonsub1
         new        2015-11-09T23:30:33 joonsub1


More information about the Tizen-submit mailing list