[Tizen-submit] 60936 declined: home:prerelease:Tizen:TV:submit:tizen:20160418.083741/bluetooth to Tizen:TV/bluetooth

noreply at tizen.org noreply at tizen.org
Mon Apr 18 23:42:27 GMT 2016


Hi DoHyun Pyun,
The following change has been rejected.

Reason:
    SR 60936 is set to declined
submit/tizen/20160418.083741 is declined(rejected)
bluetooth has build failure in Tizen:Wearable
*capi-network-bluetooth(in emulator):
[   30s] /home/abuild/rpmbuild/BUILD/capi-network-bluetooth-0.1.52/include/bluetooth_private.h:199:2: error: unknown type name 'bt_adapter_le_advertising_type_e'
[   30s] CMakeFiles/capi-network-bluetooth.dir/build.make:129: recipe for target 'CMakeFiles/capi-network-bluetooth.dir/src/bluetooth-socket.c.o' failed
[   30s] /home/abuild/rpmbuild/BUILD/capi-network-bluetooth-0.1.52/src/bluetooth-adapter.c:827:57: error: unknown type name 'bt_adapter_le_device_discovery_state_changed_cb'
...

*ug-bluetooth-efl(in target):
[  189s] /home/abuild/rpmbuild/BUILD/ug-bluetooth-efl-0.3.2/src/libraries/bt-util.c:498:13: error: 'BT_PROFILE_A2DP_SINK' undeclared (first use in this function)

This SR is also rejected in other profiles to keep code sync

Thanks,
Joonsub Lee

Please fix the issues above and resubmit.

Thanks,
Release Engineering Team

[This message was auto-generated]
---

Request: #60936

  submit:       home:prerelease:Tizen:TV:submit:tizen:20160418.083741/capi-network-bluetooth -> Tizen:TV


Message:
Submitter: Pyun DoHyun <dh79.pyun at samsung.com>
Comments: 
submit/tizen/20160418.083741 is declined(rejected)
bluetooth has build failure in Tizen:Wearable
*capi-network-bluetooth(in emulator):
[   30s] /home/abuild/rpmbuild/BUILD/capi-network-bluetooth-0.1.52/include/bluetooth_private.h:199:2: error: unknown type name 'bt_adapter_le_advertising_type_e'
[   30s] CMakeFiles/capi-network-bluetooth.dir/build.make:129: recipe for target 'CMakeFiles/capi-network-bluetooth.dir/src/bluetooth-socket.c.o' failed
[   30s] /home/abuild/rpmbuild/BUILD/capi-network-bluetooth-0.1.52/src/bluetooth-adapter.c:827:57: error: unknown type name 'bt_adapter_le_device_discovery_state_changed_cb'
...

*ug-bluetooth-efl(in target):
[  189s] /home/abuild/rpmbuild/BUILD/ug-bluetooth-efl-0.3.2/src/libraries/bt-util.c:498:13: error: 'BT_PROFILE_A2DP_SINK' undeclared (first use in this function)

This SR is also rejected in other profiles to keep code sync

Thanks,
Joonsub Lee 
Git project: [platform/core/api/bluetooth]
Tag: submit/tizen/20160418.083741

State:   revoked    2016-04-18T23:42:14 tizenrobot
Comment: The source project 'home:prerelease:Tizen:TV:submit:tizen:20160418.083741' was removed

History: declined   2016-04-18T23:42:02 joonsub1
         new        2016-04-18T23:41:59 joonsub1


More information about the Tizen-submit mailing list