[Tizen-submit] 73119 declined: home:prerelease:Tizen:TV:submit:tizen:20160810.075454/alsa-utils to Tizen:TV/alsa-utils

noreply at tizen.org noreply at tizen.org
Thu Aug 11 00:19:52 GMT 2016


Hi Heechul Jeon,
The following change has been rejected.

Reason:
    SR 73119 is set to declined
submit/tizen/20160810.075454 is declined(rejected)
capi-media-player has build failure in Tizen:TV
[  170s] /home/abuild/rpmbuild/BUILD/capi-media-player-0.3.15/test/player_test.c:1172:2: error: implicit declaration of function 'player_is_enabled_tsurf_pool' [-Werror=implicit-function-declaration]
[  170s]   player_is_enabled_tsurf_pool(g_player[0], &enabled);
[  170s] /home/abuild/rpmbuild/BUILD/capi-media-player-0.3.15/test/player_test.c:1175:2: error: implicit declaration of function 'player_enable_tsurf_pool' [-Werror=implicit-function-declaration]


Thanks,
Joonsub Lee

Please fix the issues above and resubmit.

Thanks,
Release Engineering Team

[This message was auto-generated]
---

Request: #73119

  submit:       home:prerelease:Tizen:TV:submit:tizen:20160810.075454/alsa-utils -> Tizen:TV
  submit:       home:prerelease:Tizen:TV:submit:tizen:20160810.075454/capi-media-audio-io -> Tizen:TV
  submit:       home:prerelease:Tizen:TV:submit:tizen:20160810.075454/capi-media-camera -> Tizen:TV
  submit:       home:prerelease:Tizen:TV:submit:tizen:20160810.075454/capi-media-player -> Tizen:TV
  submit:       home:prerelease:Tizen:TV:submit:tizen:20160810.075454/gst-plugins-good -> Tizen:TV
  submit:       home:prerelease:Tizen:TV:submit:tizen:20160810.075454/gst-plugins-tizen -> Tizen:TV
  submit:       home:prerelease:Tizen:TV:submit:tizen:20160810.075454/libmm-camcorder -> Tizen:TV
  submit:       home:prerelease:Tizen:TV:submit:tizen:20160810.075454/libmm-fileinfo -> Tizen:TV
  submit:       home:prerelease:Tizen:TV:submit:tizen:20160810.075454/libmm-player -> Tizen:TV
  submit:       home:prerelease:Tizen:TV:submit:tizen:20160810.075454/libmm-wfd -> Tizen:TV
  submit:       home:prerelease:Tizen:TV:submit:tizen:20160810.075454/mmsvc-camera -> Tizen:TV
  submit:       home:prerelease:Tizen:TV:submit:tizen:20160810.075454/mmsvc-player -> Tizen:TV
  submit:       home:prerelease:Tizen:TV:submit:tizen:20160810.075454/mmsvc-recorder -> Tizen:TV
  submit:       home:prerelease:Tizen:TV:submit:tizen:20160810.075454/pulseaudio -> Tizen:TV
  submit:       home:prerelease:Tizen:TV:submit:tizen:20160810.075454/recorder -> Tizen:TV


Message:
Submitter: Heechul Jeon <heechul.jeon at samsung.com>
Comments: 
submit/tizen/20160810.075454 is declined(rejected)
capi-media-player has build failure in Tizen:TV
[  170s] /home/abuild/rpmbuild/BUILD/capi-media-player-0.3.15/test/player_test.c:1172:2: error: implicit declaration of function 'player_is_enabled_tsurf_pool' [-Werror=implicit-function-declaration]
[  170s]   player_is_enabled_tsurf_pool(g_player[0], &enabled);
[  170s] /home/abuild/rpmbuild/BUILD/capi-media-player-0.3.15/test/player_test.c:1175:2: error: implicit declaration of function 'player_enable_tsurf_pool' [-Werror=implicit-function-declaration]


Thanks,
Joonsub Lee 
Git project: [platform/core/multimedia/libmm-fileinfo, platform/core/multimedia/libmm-wfd, platform/upstream/gst-plugins-good, platform/core/api/camera, platform/core/api/recorder, platform/core/multimedia/mmsvc-recorder, platform/core/api/player, platform/core/multimedia/mmsvc-camera, platform/upstream/gst-plugins-tizen, platform/core/api/audio-io, platform/upstream/pulseaudio, platform/core/multimedia/libmm-camcorder, platform/upstream/alsa-utils, platform/core/multimedia/libmm-player, platform/core/multimedia/mmsvc-player]
Tag: submit/tizen/20160810.075454

State:   revoked    2016-08-11T00:19:21 tizenrobot
Comment: The source project 'home:prerelease:Tizen:TV:submit:tizen:20160810.075454' was removed

History: declined   2016-08-11T00:19:06 joonsub1
         new        2016-08-11T00:18:48 joonsub1


More information about the Tizen-submit mailing list