[Tizen-submit] 73120 declined: home:prerelease:Tizen:Wearable:submit:tizen:20160810.075454/gst-plugins-tizen to Tizen:Wearable/gst-plugins-tizen

noreply at tizen.org noreply at tizen.org
Thu Aug 11 00:20:21 GMT 2016


Hi Heechul Jeon,
The following change has been rejected.

Reason:
    SR 73120 is set to declined
submit/tizen/20160810.075454 is declined(rejected)
capi-media-player has build failure in Tizen:TV
[  170s] /home/abuild/rpmbuild/BUILD/capi-media-player-0.3.15/test/player_test.c:1172:2: error: implicit declaration of function 'player_is_enabled_tsurf_pool' [-Werror=implicit-function-declaration]
[  170s]   player_is_enabled_tsurf_pool(g_player[0], &enabled);
[  170s] /home/abuild/rpmbuild/BUILD/capi-media-player-0.3.15/test/player_test.c:1175:2: error: implicit declaration of function 'player_enable_tsurf_pool' [-Werror=implicit-function-declaration]


Thanks,
Joonsub Lee

Please fix the issues above and resubmit.

Thanks,
Release Engineering Team

[This message was auto-generated]
---

Request: #73120

  submit:       home:prerelease:Tizen:Wearable:submit:tizen:20160810.075454/alsa-utils -> Tizen:Wearable
  submit:       home:prerelease:Tizen:Wearable:submit:tizen:20160810.075454/capi-media-audio-io -> Tizen:Wearable
  submit:       home:prerelease:Tizen:Wearable:submit:tizen:20160810.075454/capi-media-camera -> Tizen:Wearable
  submit:       home:prerelease:Tizen:Wearable:submit:tizen:20160810.075454/capi-media-player -> Tizen:Wearable
  submit:       home:prerelease:Tizen:Wearable:submit:tizen:20160810.075454/gst-plugins-good -> Tizen:Wearable
  submit:       home:prerelease:Tizen:Wearable:submit:tizen:20160810.075454/gst-plugins-tizen -> Tizen:Wearable
  submit:       home:prerelease:Tizen:Wearable:submit:tizen:20160810.075454/libmm-camcorder -> Tizen:Wearable
  submit:       home:prerelease:Tizen:Wearable:submit:tizen:20160810.075454/libmm-fileinfo -> Tizen:Wearable
  submit:       home:prerelease:Tizen:Wearable:submit:tizen:20160810.075454/libmm-player -> Tizen:Wearable
  submit:       home:prerelease:Tizen:Wearable:submit:tizen:20160810.075454/mmsvc-camera -> Tizen:Wearable
  submit:       home:prerelease:Tizen:Wearable:submit:tizen:20160810.075454/mmsvc-player -> Tizen:Wearable
  submit:       home:prerelease:Tizen:Wearable:submit:tizen:20160810.075454/mmsvc-recorder -> Tizen:Wearable
  submit:       home:prerelease:Tizen:Wearable:submit:tizen:20160810.075454/pulseaudio -> Tizen:Wearable
  submit:       home:prerelease:Tizen:Wearable:submit:tizen:20160810.075454/recorder -> Tizen:Wearable


Message:
Submitter: Heechul Jeon <heechul.jeon at samsung.com>
Comments: 
submit/tizen/20160810.075454 is declined(rejected)
capi-media-player has build failure in Tizen:TV
[  170s] /home/abuild/rpmbuild/BUILD/capi-media-player-0.3.15/test/player_test.c:1172:2: error: implicit declaration of function 'player_is_enabled_tsurf_pool' [-Werror=implicit-function-declaration]
[  170s]   player_is_enabled_tsurf_pool(g_player[0], &enabled);
[  170s] /home/abuild/rpmbuild/BUILD/capi-media-player-0.3.15/test/player_test.c:1175:2: error: implicit declaration of function 'player_enable_tsurf_pool' [-Werror=implicit-function-declaration]


Thanks,
Joonsub Lee 
Git project: [platform/core/multimedia/libmm-fileinfo, platform/upstream/gst-plugins-good, platform/core/api/camera, platform/core/api/recorder, platform/core/multimedia/mmsvc-recorder, platform/core/api/player, platform/upstream/gst-plugins-tizen, platform/core/api/audio-io, platform/upstream/pulseaudio, platform/core/multimedia/libmm-camcorder, platform/core/multimedia/mmsvc-player, platform/upstream/alsa-utils, platform/core/multimedia/libmm-player, platform/core/multimedia/mmsvc-camera]
Tag: submit/tizen/20160810.075454

State:   revoked    2016-08-11T00:19:52 tizenrobot
Comment: The source project 'home:prerelease:Tizen:Wearable:submit:tizen:20160810.075454' was removed

History: declined   2016-08-11T00:19:28 joonsub1
         new        2016-08-11T00:19:20 joonsub1


More information about the Tizen-submit mailing list