[Tizen-submit] 63473 declined: home:prerelease:Tizen:Mobile:submit:tizen:20160513.042344/system-popup to Tizen:Mobile/system-popup

noreply at tizen.org noreply at tizen.org
Fri May 13 06:40:07 GMT 2016


Hi changjoo.lee,
The following change has been rejected.

Reason:
    SR 63473 is set to declined
submit/tizen/20160513.042344 is declined(rejected)
system-popup introduce system-servant's build failure in Tizen:Wearable

[   37s] /home/abuild/rpmbuild/BUILD/system-servant-0.2.0/src/common/popup-ui-circle.c:101:30: error: 'RESDIR' undeclared (first use in this function)
[   37s] /home/abuild/rpmbuild/BUILD/system-servant-0.2.0/src/common/popup-ui-circle.c:101:36: error: expected ')' before string constant
[   37s] /home/abuild/rpmbuild/BUILD/system-servant-0.2.0/src/common/popup-ui-circle.c:101:5: error: too few arguments to function 'elm_image_file_set'
[   37s] /home/abuild/rpmbuild/BUILD/system-servant-0.2.0/src/common/popup-ui-circle.c:118:36: error: expected ')' before string constant
[   37s] /home/abuild/rpmbuild/BUILD/system-servant-0.2.0/src/common/popup-ui-circle.c:118:5: error: too few arguments to function 'elm_image_file_set'

Thanks,
Joonsub Lee

Please fix the issues above and resubmit.

Thanks,
Release Engineering Team

[This message was auto-generated]
---

Request: #63473

  submit:       home:prerelease:Tizen:Mobile:submit:tizen:20160513.042344/system-servant -> Tizen:Mobile


Message:
Submitter: Chang Joo Lee <changjoo.lee at samsung.com>
Comments: 
submit/tizen/20160513.042344 is declined(rejected)
system-popup introduce system-servant's build failure in Tizen:Wearable

[   37s] /home/abuild/rpmbuild/BUILD/system-servant-0.2.0/src/common/popup-ui-circle.c:101:30: error: 'RESDIR' undeclared (first use in this function)
[   37s] /home/abuild/rpmbuild/BUILD/system-servant-0.2.0/src/common/popup-ui-circle.c:101:36: error: expected ')' before string constant
[   37s] /home/abuild/rpmbuild/BUILD/system-servant-0.2.0/src/common/popup-ui-circle.c:101:5: error: too few arguments to function 'elm_image_file_set'
[   37s] /home/abuild/rpmbuild/BUILD/system-servant-0.2.0/src/common/popup-ui-circle.c:118:36: error: expected ')' before string constant
[   37s] /home/abuild/rpmbuild/BUILD/system-servant-0.2.0/src/common/popup-ui-circle.c:118:5: error: too few arguments to function 'elm_image_file_set'

Thanks,
Joonsub Lee 
Git project: [platform/core/system/system-popup]
Tag: submit/tizen/20160513.042344

State:   revoked    2016-05-13T06:39:57 tizenrobot
Comment: The source project 'home:prerelease:Tizen:Mobile:submit:tizen:20160513.042344' was removed

History: declined   2016-05-13T06:39:47 joonsub1
         new        2016-05-13T06:39:44 joonsub1


More information about the Tizen-submit mailing list