[Tizen-submit] 63732 declined: home:prerelease:Tizen:Wearable:submit:tizen:20160517.005404/tpk-manifest-handlers to Tizen:Wearable/tpk-manifest-handlers

noreply at tizen.org noreply at tizen.org
Tue May 17 08:31:58 GMT 2016


Hi jongmyeongko,
The following change has been rejected.

Reason:
    SR 63732 is set to declined
submit/tizen/20160517.005404 is declined(rejected)
app-installers has build failure in all repos:

[  199s] /usr/lib/gcc/armv7l-tizen-linux-gnueabi/4.9.2/../../../../armv7l-tizen-linux-gnueabi/bin/ld: cannot find -ltpk-manifest-handlers
[  199s] /usr/lib/gcc/armv7l-tizen-linux-gnueabi/4.9.2/../../../../armv7l-tizen-linux-gnueabi/bin/ld: cannot find -ltpk-manifest-handlers
[  199s] collect2: error: ld returned 1 exit status
[  199s] src/common/CMakeFiles/app-installers.dir/build.make:1974: recipe for target 'src/common/libapp-installers.so.0.1.0' failed
[  199s] make[2]: *** [src/common/libapp-installers.so.0.1.0] Error 1

Thanks,
Joonsub Lee

Please fix the issues above and resubmit.

Thanks,
Release Engineering Team

[This message was auto-generated]
---

Request: #63732

  submit:       home:prerelease:Tizen:Wearable:submit:tizen:20160517.005404/amd -> Tizen:Wearable
  submit:       home:prerelease:Tizen:Wearable:submit:tizen:20160517.005404/app-installers -> Tizen:Wearable
  submit:       home:prerelease:Tizen:Wearable:submit:tizen:20160517.005404/aul -> Tizen:Wearable
  submit:       home:prerelease:Tizen:Wearable:submit:tizen:20160517.005404/capi-appfw-package-manager -> Tizen:Wearable
  submit:       home:prerelease:Tizen:Wearable:submit:tizen:20160517.005404/manifest-parser -> Tizen:Wearable
  submit:       home:prerelease:Tizen:Wearable:submit:tizen:20160517.005404/minicontrol -> Tizen:Wearable
  submit:       home:prerelease:Tizen:Wearable:submit:tizen:20160517.005404/notification -> Tizen:Wearable
  submit:       home:prerelease:Tizen:Wearable:submit:tizen:20160517.005404/pkgmgr-info -> Tizen:Wearable
  submit:       home:prerelease:Tizen:Wearable:submit:tizen:20160517.005404/tpk-manifest-handlers -> Tizen:Wearable
  submit:       home:prerelease:Tizen:Wearable:submit:tizen:20160517.005404/wgt-manifest-handlers -> Tizen:Wearable


Message:
Submitter: jongmyeong ko <jongmyeong.ko at samsung.com>
Comments: 
submit/tizen/20160517.005404 is declined(rejected)
app-installers has build failure in all repos:

[  199s] /usr/lib/gcc/armv7l-tizen-linux-gnueabi/4.9.2/../../../../armv7l-tizen-linux-gnueabi/bin/ld: cannot find -ltpk-manifest-handlers
[  199s] /usr/lib/gcc/armv7l-tizen-linux-gnueabi/4.9.2/../../../../armv7l-tizen-linux-gnueabi/bin/ld: cannot find -ltpk-manifest-handlers
[  199s] collect2: error: ld returned 1 exit status
[  199s] src/common/CMakeFiles/app-installers.dir/build.make:1974: recipe for target 'src/common/libapp-installers.so.0.1.0' failed
[  199s] make[2]: *** [src/common/libapp-installers.so.0.1.0] Error 1

Thanks,
Joonsub Lee 
Git project: [platform/core/api/notification, platform/core/appfw/wgt-manifest-handlers, platform/core/appfw/manifest-parser, platform/core/appfw/aul-1, platform/core/api/package-manager, platform/core/appfw/app-installers, platform/core/appfw/pkgmgr-info, platform/core/appfw/minicontrol, platform/core/appfw/amd, platform/core/appfw/tpk-manifest-handlers]
Tag: submit/tizen/20160517.005404

State:   revoked    2016-05-17T08:31:34 tizenrobot
Comment: The source project 'home:prerelease:Tizen:Wearable:submit:tizen:20160517.005404' was removed

History: declined   2016-05-17T08:31:25 joonsub1
         new        2016-05-17T08:31:18 joonsub1


More information about the Tizen-submit mailing list