[Tizen-submit] 64045 declined: home:prerelease:Tizen:Wearable:submit:tizen:20160518.110440/dpm-toolkit to Tizen:Wearable/dpm-toolkit

noreply at tizen.org noreply at tizen.org
Thu May 19 04:37:15 GMT 2016


Hi Sungbae Yoo,
The following change has been rejected.

Reason:
    SR 64045 is set to declined
submit/tizen/20160518.110440 is declined(rejected)
dpm-toolkit has build failure:

[  230s] /home/abuild/rpmbuild/BUILD/org.tizen.dpm-toolkit-0.1/src/password.c:52:27: error: too few arguments to function 'dpm_context_acquire_password_policy'
[  230s] /home/abuild/rpmbuild/BUILD/org.tizen.dpm-toolkit-0.1/src/wifi.c:23:11: error: too few arguments to function 'dpm_context_acquire_wifi_policy'
[  230s] /home/abuild/rpmbuild/BUILD/org.tizen.dpm-toolkit-0.1/src/restriction.c:734:2: error: implicit declaration of function 'dpm_restriction_set_bluetooth_tethering_state' [-Werror=implicit-function-declaration]
...

Please check the build status

Thanks,
Joonsub Lee

Please fix the issues above and resubmit.

Thanks,
Release Engineering Team

[This message was auto-generated]
---

Request: #64045

  submit:       home:prerelease:Tizen:Wearable:submit:tizen:20160518.110440/dpm-toolkit -> Tizen:Wearable


Message:
Submitter: Sungbae Yoo <sungbae.yoo at samsung.com>
Comments: 
submit/tizen/20160518.110440 is declined(rejected)
dpm-toolkit has build failure:

[  230s] /home/abuild/rpmbuild/BUILD/org.tizen.dpm-toolkit-0.1/src/password.c:52:27: error: too few arguments to function 'dpm_context_acquire_password_policy'
[  230s] /home/abuild/rpmbuild/BUILD/org.tizen.dpm-toolkit-0.1/src/wifi.c:23:11: error: too few arguments to function 'dpm_context_acquire_wifi_policy'
[  230s] /home/abuild/rpmbuild/BUILD/org.tizen.dpm-toolkit-0.1/src/restriction.c:734:2: error: implicit declaration of function 'dpm_restriction_set_bluetooth_tethering_state' [-Werror=implicit-function-declaration]
...

Please check the build status

Thanks,
Joonsub Lee 
Git project: [platform/core/security/dpm-toolkit]
Tag: submit/tizen/20160518.110440

State:   revoked    2016-05-19T04:37:04 tizenrobot
Comment: The source project 'home:prerelease:Tizen:Wearable:submit:tizen:20160518.110440' was removed

History: declined   2016-05-19T04:36:51 joonsub1
         new        2016-05-19T04:36:48 joonsub1


More information about the Tizen-submit mailing list