[Tizen-submit] 64220 declined: home:prerelease:Tizen:Wearable:submit:tizen:20160520.014953/bt-syspopup to Tizen:Wearable/bt-syspopup

noreply at tizen.org noreply at tizen.org
Fri May 20 07:50:07 GMT 2016


Hi DoHyun Pyun,
The following change has been rejected.

Reason:
    SR 64220 is set to declined
submit/tizen/20160520.014953 is declined(rejected)
org.tizen.bt-syspopup has build failure in Tizen:Wearable:

[  122s] /home/abuild/rpmbuild/BUILD/org.tizen.bt-syspopup-0.3.1/src/bt-syspopup-w.c:996:2: error: too many arguments for format [-Werror=format-extra-args]
[  122s] /home/abuild/rpmbuild/BUILD/org.tizen.bt-syspopup-0.3.1/src/bt-syspopup-w.c:1614:15: error: assignment makes pointer from integer without a cast [-Werror]
...

Please check the build status

Thanks,
Joonsub Lee

Please fix the issues above and resubmit.

Thanks,
Release Engineering Team

[This message was auto-generated]
---

Request: #64220

  submit:       home:prerelease:Tizen:Wearable:submit:tizen:20160520.014953/org.tizen.bt-syspopup -> Tizen:Wearable


Message:
Submitter: Pyun DoHyun <dh79.pyun at samsung.com>
Comments: 
submit/tizen/20160520.014953 is declined(rejected)
org.tizen.bt-syspopup has build failure in Tizen:Wearable:

[  122s] /home/abuild/rpmbuild/BUILD/org.tizen.bt-syspopup-0.3.1/src/bt-syspopup-w.c:996:2: error: too many arguments for format [-Werror=format-extra-args]
[  122s] /home/abuild/rpmbuild/BUILD/org.tizen.bt-syspopup-0.3.1/src/bt-syspopup-w.c:1614:15: error: assignment makes pointer from integer without a cast [-Werror]
...

Please check the build status

Thanks,
Joonsub Lee 
Git project: [apps/core/preloaded/bt-syspopup]
Tag: submit/tizen/20160520.014953

State:   revoked    2016-05-20T07:49:56 tizenrobot
Comment: The source project 'home:prerelease:Tizen:Wearable:submit:tizen:20160520.014953' was removed

History: declined   2016-05-20T07:49:40 joonsub1
         new        2016-05-20T07:49:37 joonsub1


More information about the Tizen-submit mailing list