[Tizen-submit] 64769 declined: home:prerelease:Tizen:Mobile:submit:tizen:20160524.083338/elementary to Tizen:Mobile/elementary

noreply at tizen.org noreply at tizen.org
Wed May 25 04:23:08 GMT 2016


Hi Jiwon Kim,
The following change has been rejected.

Reason:
    SR 64769 is set to declined
submit/tizen/20160524.083338 is declined(rejected)
org.tizen.w-home has build failure in Wearable target repo:
[  187s] CMakeFiles/w-home.dir/src/clock.c.o: In function watch_manager_send_terminate'
[  187s] collect2: error: ld returned 1 exit status
[  187s] home/CMakeFiles/w-home.dir/build.make:1388: recipe for target 'home/w-home' failed
[  187s] make[2]: *** [home/w-home] Error 1
[  187s] CMakeFiles/Makefile2:102: recipe for target 'home/CMakeFiles/w-home.dir/all' failed
[  187s] make[1]: *** [home/CMakeFiles/w-home.dir/all] Error 2
[  187s] Makefile:116: recipe for target 'all' failed
[  187s] make: *** [all] Error 2
[  187s] error: Bad exit status from /var/tmp/rpm-tmp.hXojL5 (%build)

Please check the build status

Thanks,
Joonsub Lee

Please fix the issues above and resubmit.

Thanks,
Release Engineering Team

[This message was auto-generated]
---

Request: #64769

  submit:       home:prerelease:Tizen:Mobile:submit:tizen:20160524.083338/efl -> Tizen:Mobile
  submit:       home:prerelease:Tizen:Mobile:submit:tizen:20160524.083338/elementary -> Tizen:Mobile


Message:
Submitter: Jiwon Kim <jiwon177.kim at samsung.com>
Comments: 
submit/tizen/20160524.083338 is declined(rejected)
org.tizen.w-home has build failure in Wearable target repo:
[  187s] CMakeFiles/w-home.dir/src/clock.c.o: In function watch_manager_send_terminate'
[  187s] collect2: error: ld returned 1 exit status
[  187s] home/CMakeFiles/w-home.dir/build.make:1388: recipe for target 'home/w-home' failed
[  187s] make[2]: *** [home/w-home] Error 1
[  187s] CMakeFiles/Makefile2:102: recipe for target 'home/CMakeFiles/w-home.dir/all' failed
[  187s] make[1]: *** [home/CMakeFiles/w-home.dir/all] Error 2
[  187s] Makefile:116: recipe for target 'all' failed
[  187s] make: *** [all] Error 2
[  187s] error: Bad exit status from /var/tmp/rpm-tmp.hXojL5 (%build)

Please check the build status

Thanks,
Joonsub Lee 
Git project: [platform/upstream/efl, platform/upstream/elementary]
Tag: submit/tizen/20160524.083338

State:   revoked    2016-05-25T04:22:56 tizenrobot
Comment: The source project 'home:prerelease:Tizen:Mobile:submit:tizen:20160524.083338' was removed

History: declined   2016-05-25T04:22:46 joonsub1
         new        2016-05-25T04:22:42 joonsub1


More information about the Tizen-submit mailing list