[Tizen-submit] 8427 declined: home:prerelease:Tizen:4.0:Unified:submit:tizen_4.0:20171031.231258/aul-1 to Tizen:4.0:Unified/aul-1

noreply at tizen.org noreply at tizen.org
Wed Nov 1 06:58:52 UTC 2017


Hi Hwankyu Jhun,
The following change has been rejected.

Reason:
    SR 8427 is set to declinedsubmission submit/tizen_4.0/20171031.231258

build failed launchpad

--------------------
[   76s] /home/abuild/rpmbuild/BUILD/launchpad-0.3.7/src/launchpad_lib.c: In function '__prepare_exec':
[   76s] /home/abuild/rpmbuild/BUILD/launchpad-0.3.7/src/launchpad_lib.c:77:11: error: 'TRUST_ANCHOR_ERROR_NOT_INSTALLED' undeclared (first use in this function)
[   76s]     ret != TRUST_ANCHOR_ERROR_NOT_INSTALLED) {
[   76s]            ^~~~~~~~~~~~~~~~~~~~~~~~~~~~~~~~
[   76s] /home/abuild/rpmbuild/BUILD/launchpad-0.3.7/src/launchpad_lib.c:77:11: note: each undeclared identifier is reported only once for each function it appears in
[   76s] CMakeFiles/launchpad-loader.dir/build.make:106: recipe for target 'CMakeFiles/launchpad-loader.dir/src/launchpad_lib.c.o' failed
[   76s] make[2]: *** [CMakeFiles/launchpad-loader.dir/src/launchpad_lib.c.o] Error 1
[   76s] make[2]: *** Waiting for unfinished jobs....
[   76s] make[2]: Leaving directory '/home/abuild/rpmbuild/BUILD/launchpad-0.3.7'
[   76s]

Please fix the issues above and resubmit.

Thanks,
Release Engineering Team

[This message was auto-generated]
---

Request: #8427

  submit:       home:prerelease:Tizen:4.0:Unified:submit:tizen_4.0:20171031.231258/amd -> Tizen:4.0:Unified
  submit:       home:prerelease:Tizen:4.0:Unified:submit:tizen_4.0:20171031.231258/aul -> Tizen:4.0:Unified
  submit:       home:prerelease:Tizen:4.0:Unified:submit:tizen_4.0:20171031.231258/launchpad -> Tizen:4.0:Unified


Message:
Submitter: Hwankyu Jhun  <h.jhun at samsung.com>
Comments: submission submit/tizen_4.0/20171031.231258

build failed launchpad

--------------------
[   76s] /home/abuild/rpmbuild/BUILD/launchpad-0.3.7/src/launchpad_lib.c: In function '__prepare_exec':
[   76s] /home/abuild/rpmbuild/BUILD/launchpad-0.3.7/src/launchpad_lib.c:77:11: error: 'TRUST_ANCHOR_ERROR_NOT_INSTALLED' undeclared (first use in this function)
[   76s]     ret != TRUST_ANCHOR_ERROR_NOT_INSTALLED) {
[   76s]            ^~~~~~~~~~~~~~~~~~~~~~~~~~~~~~~~
[   76s] /home/abuild/rpmbuild/BUILD/launchpad-0.3.7/src/launchpad_lib.c:77:11: note: each undeclared identifier is reported only once for each function it appears in
[   76s] CMakeFiles/launchpad-loader.dir/build.make:106: recipe for target 'CMakeFiles/launchpad-loader.dir/src/launchpad_lib.c.o' failed
[   76s] make[2]: *** [CMakeFiles/launchpad-loader.dir/src/launchpad_lib.c.o] Error 1
[   76s] make[2]: *** Waiting for unfinished jobs....
[   76s] make[2]: Leaving directory '/home/abuild/rpmbuild/BUILD/launchpad-0.3.7'
[   76s] 
Git project: [platform/core/appfw/aul-1, platform/core/appfw/amd, platform/core/appfw/launchpad]
Tag: submit/tizen_4.0/20171031.231258

State:   revoked    2017-11-01T06:58:33 tizenrobot
Comment: The source project 'home:prerelease:Tizen:4.0:Unified:submit:tizen_4.0:20171031.231258' has been removed

History: 2017-11-01T06:58:33 tizenrobot   Request got revoked
         2017-11-01T06:57:52 tizenrobot   Request got declined
         2017-11-01T06:57:51 tizenrobot   Request created


More information about the Tizen-submit mailing list